【发布时间】:2017-02-20 00:45:00
【问题描述】:
一些可能有用的信息:
- 项目:基于 maven 的 cdi
- 环境:Ubuntu 16.04
- JDK:oracle 8
- IDE:Netbeans 8.2
这是正在测试的 CDI Bean:
@Named
@SessionScoped
public class UserPreferencies implements Serializable {
private Locale currentLocale;
public UserPreferencies() {
//locale is initiated to French but may be overriden in the
//post-constructed method
currentLocale = new Locale("fr");
}
@PostConstruct
public void initialize() {
/**
* if a user specific locale is provided in the browser
* we should be setting it here
*/
if(FacesContext.getCurrentInstance() != null){
Optional<ExternalContext> optContext = ofNullable(FacesContext.getCurrentInstance()
.getExternalContext());
if (optContext.isPresent()) {
Optional<Locale> userLocale = ofNullable(optContext.get().getRequestLocale());
if (userLocale.isPresent()) {
currentLocale = userLocale.get();
}
}
}
}
public Locale getCurrentLocale() {
return currentLocale;
}
public void setCurrentLocale(Locale currentLocale) {
this.currentLocale = currentLocale;
}
}
这些是相关的 pom.xml 设置(写在official arquillian guide之后):
<dependencies>
...
<!-- the support for the arquillian test framework -->
<dependency>
<groupId>org.jboss.arquillian</groupId>
<artifactId>arquillian-bom</artifactId>
<version>1.1.11.Final</version>
<scope>import</scope>
<type>pom</type>
</dependency>
<dependency>
<groupId>org.jboss.arquillian.junit</groupId>
<artifactId>arquillian-junit-container</artifactId>
<version>1.1.11.Final</version>
<scope>test</scope>
</dependency>
</dependencies>
<profiles>
<profile>
<id>arquillian-glassfish-embedded</id>
<dependencies>
<dependency>
<groupId>org.jboss.arquillian.container</groupId>
<artifactId>arquillian-glassfish-embedded-3.1</artifactId>
<version>1.0.0.CR4</version>
<scope>test</scope>
<exclusions>
<exclusion> <groupId>org.jboss.arquillian.container</groupId>
<artifactId>arquillian-container-spi</artifactId>
</exclusion>
</exclusions>
</dependency>
<dependency>
<groupId>org.glassfish.main.extras</groupId>
<artifactId>glassfish-embedded-all</artifactId>
<version>3.1.2</version>
<scope>provided</scope>
</dependency>
</dependencies>
</profile>
</profiles>
然后我使用 NetBeans 的“设置配置”选项设置上述 maven 配置文件。
这是我正在尝试运行的测试(您可能会看到相当基本的测试):
@RunWith(Arquillian.class)
public class UserPreferenciesTests {
public UserPreferenciesTests() {
}
//humble attempt to mock glassfish only with the UserPreferencies bean inside
@Deployment
public static JavaArchive createDeployment() {
JavaArchive jar = ShrinkWrap.create(JavaArchive.class)
.addClass(UserPreferencies.class)
.addAsManifestResource(EmptyAsset.INSTANCE, "beans.xml");
System.out.println(jar.toString(true));
return jar;
}
@Inject
UserPreferencies preferencies;
@Test
public void localeIsNotNull(){
assertNotNull(preferencies.getCurrentLocale().getCountry());
}
@Test
public void defaultLocaleTest() {
assertTrue("The default locale should be \"fr\"",
"fr".equalsIgnoreCase(preferencies.getCurrentLocale().getLanguage()));
}
}
不幸的是,运行测试会产生以下堆栈跟踪:
Running com.vgorcinschi.rimmanew.cdi.UserPreferenciesTests
Tests run: 1, Failures: 0, Errors: 1, Skipped: 0, Time elapsed: 0.512 sec <<< FAILURE! - in com.vgorcinschi.rimmanew.cdi.UserPreferenciesTests
com.vgorcinschi.rimmanew.cdi.UserPreferenciesTests Time elapsed: 0.51 sec <<< ERROR!
java.lang.RuntimeException: Could not create new instance of class org.jboss.arquillian.test.impl.EventTestRunnerAdaptor
at org.jboss.arquillian.test.spi.SecurityActions.newInstance(SecurityActions.java:165)
at org.jboss.arquillian.test.spi.SecurityActions.newInstance(SecurityActions.java:102)
at org.jboss.arquillian.test.spi.TestRunnerAdaptorBuilder.build(TestRunnerAdaptorBuilder.java:52)
at org.jboss.arquillian.junit.Arquillian.run(Arquillian.java:113)
at org.apache.maven.surefire.junit4.JUnit4Provider.execute(JUnit4Provider.java:283)
at org.apache.maven.surefire.junit4.JUnit4Provider.executeWithRerun(JUnit4Provider.java:173)
at org.apache.maven.surefire.junit4.JUnit4Provider.executeTestSet(JUnit4Provider.java:153)
at org.apache.maven.surefire.junit4.JUnit4Provider.invoke(JUnit4Provider.java:128)
at org.apache.maven.surefire.booter.ForkedBooter.invokeProviderInSameClassLoader(ForkedBooter.java:203)
at org.apache.maven.surefire.booter.ForkedBooter.runSuitesInProcess(ForkedBooter.java:155)
at org.apache.maven.surefire.booter.ForkedBooter.main(ForkedBooter.java:103)
Caused by: java.lang.reflect.InvocationTargetException: null
at sun.reflect.NativeConstructorAccessorImpl.newInstance0(Native Method)
at sun.reflect.NativeConstructorAccessorImpl.newInstance(NativeConstructorAccessorImpl.java:62)
at sun.reflect.DelegatingConstructorAccessorImpl.newInstance(DelegatingConstructorAccessorImpl.java:45)
at java.lang.reflect.Constructor.newInstance(Constructor.java:423)
at org.jboss.arquillian.test.spi.SecurityActions.newInstance(SecurityActions.java:161)
at org.jboss.arquillian.test.spi.SecurityActions.newInstance(SecurityActions.java:102)
at org.jboss.arquillian.test.spi.TestRunnerAdaptorBuilder.build(TestRunnerAdaptorBuilder.java:52)
at org.jboss.arquillian.junit.Arquillian.run(Arquillian.java:113)
at org.apache.maven.surefire.junit4.JUnit4Provider.execute(JUnit4Provider.java:283)
at org.apache.maven.surefire.junit4.JUnit4Provider.executeWithRerun(JUnit4Provider.java:173)
at org.apache.maven.surefire.junit4.JUnit4Provider.executeTestSet(JUnit4Provider.java:153)
at org.apache.maven.surefire.junit4.JUnit4Provider.invoke(JUnit4Provider.java:128)
at org.apache.maven.surefire.booter.ForkedBooter.invokeProviderInSameClassLoader(ForkedBooter.java:203)
at org.apache.maven.surefire.booter.ForkedBooter.runSuitesInProcess(ForkedBooter.java:155)
at org.apache.maven.surefire.booter.ForkedBooter.main(ForkedBooter.java:103)
Caused by: java.lang.NoSuchMethodError: org.jboss.shrinkwrap.descriptor.api.DescriptorImporter.fromString(Ljava/lang/String;)Lorg/jboss/shrinkwrap/descriptor/api/Descriptor;
at org.jboss.arquillian.config.impl.extension.ConfigurationSysPropResolver.resolveSystemProperties(ConfigurationSysPropResolver.java:55)
at org.jboss.arquillian.config.impl.extension.ConfigurationRegistrar.loadConfiguration(ConfigurationRegistrar.java:71)
at sun.reflect.NativeMethodAccessorImpl.invoke0(Native Method)
at sun.reflect.NativeMethodAccessorImpl.invoke(NativeMethodAccessorImpl.java:62)
at sun.reflect.DelegatingMethodAccessorImpl.invoke(DelegatingMethodAccessorImpl.java:43)
at java.lang.reflect.Method.invoke(Method.java:498)
at org.jboss.arquillian.core.impl.ObserverImpl.invoke(ObserverImpl.java:94)
at org.jboss.arquillian.core.impl.EventContextImpl.invokeObservers(EventContextImpl.java:99)
at org.jboss.arquillian.core.impl.EventContextImpl.proceed(EventContextImpl.java:81)
at org.jboss.arquillian.core.impl.ManagerImpl.fire(ManagerImpl.java:145)
at org.jboss.arquillian.core.impl.ManagerImpl.fire(ManagerImpl.java:116)
at org.jboss.arquillian.core.impl.ManagerImpl.start(ManagerImpl.java:290)
at org.jboss.arquillian.test.impl.EventTestRunnerAdaptor.<init>(EventTestRunnerAdaptor.java:63)
at sun.reflect.NativeConstructorAccessorImpl.newInstance0(Native Method)
at sun.reflect.NativeConstructorAccessorImpl.newInstance(NativeConstructorAccessorImpl.java:62)
at sun.reflect.DelegatingConstructorAccessorImpl.newInstance(DelegatingConstructorAccessorImpl.java:45)
at java.lang.reflect.Constructor.newInstance(Constructor.java:423)
at org.jboss.arquillian.test.spi.SecurityActions.newInstance(SecurityActions.java:161)
at org.jboss.arquillian.test.spi.SecurityActions.newInstance(SecurityActions.java:102)
at org.jboss.arquillian.test.spi.TestRunnerAdaptorBuilder.build(TestRunnerAdaptorBuilder.java:52)
at org.jboss.arquillian.junit.Arquillian.run(Arquillian.java:113)
at org.apache.maven.surefire.junit4.JUnit4Provider.execute(JUnit4Provider.java:283)
at org.apache.maven.surefire.junit4.JUnit4Provider.executeWithRerun(JUnit4Provider.java:173)
at org.apache.maven.surefire.junit4.JUnit4Provider.executeTestSet(JUnit4Provider.java:153)
at org.apache.maven.surefire.junit4.JUnit4Provider.invoke(JUnit4Provider.java:128)
at org.apache.maven.surefire.booter.ForkedBooter.invokeProviderInSameClassLoader(ForkedBooter.java:203)
at org.apache.maven.surefire.booter.ForkedBooter.runSuitesInProcess(ForkedBooter.java:155)
at org.apache.maven.surefire.booter.ForkedBooter.main(ForkedBooter.java:103)
Results :
Tests in error:
UserPreferenciesTests.com.vgorcinschi.rimmanew.cdi.UserPreferenciesTests » Runtime
Tests run: 1, Failures: 0, Errors: 1, Skipped: 0
------------------------------------------------------------------------
BUILD FAILURE
感谢任何关于这个问题的建议或分享的专业知识,因为虽然我在 arquillian 网站上做了很多阅读,但我对在实践方面使用 Arquillian 进行测试还很陌生。
[更新]
执行mvn dependency:tree -Dverbose 我发现新库的一个依赖冲突导致新库被省略(我更新了上面的 pom 文件)。这是新的错误(org.jvnet.hk2.component.MultiMap 确实从项目中丢失,但我排除的库没有被删除 - 它被正确的版本替换...):
com.vgorcinschi.rimmanew.cdi.UserPreferenciesTests Time elapsed:
0.666 sec <<< ERROR!
java.lang.NoSuchMethodError: org.jvnet.hk2.component.MultiMap.<init>(Z)V
at org.jvnet.hk2.component.Habitat.<init>(Habitat.java:127)
at org.jvnet.hk2.component.Habitat.<init>(Habitat.java:120)
at com.sun.enterprise.module.common_impl.AbstractModulesRegistryImpl.newHabitat(AbstractModulesRegistryImpl.java:118)
at com.sun.enterprise.module.bootstrap.Main.createHabitat(Main.java:444)
at com.sun.enterprise.glassfish.bootstrap.StaticGlassFishRuntime.newGlassFish(StaticGlassFishRuntime.java:104)
at org.jboss.arquillian.container.glassfish.embedded_3_1.GlassFishContainer.setup(GlassFishContainer.java:147)
at org.jboss.arquillian.container.glassfish.embedded_3_1.GlassFishContainer.setup(GlassFishContainer.java:67)
at org.jboss.arquillian.container.impl.ContainerImpl.setup(ContainerImpl.java:181)
at org.jboss.arquillian.container.impl.client.container.ContainerLifecycleController$7.perform(ContainerLifecycleController.java:149)
at org.jboss.arquillian.container.impl.client.container.ContainerLifecycleController$7.perform(ContainerLifecycleController.java:145)
at org.jboss.arquillian.container.impl.client.container.ContainerLifecycleController.forContainer(ContainerLifecycleController.java:255)
at org.jboss.arquillian.container.impl.client.container.ContainerLifecycleController.setupContainer(ContainerLifecycleController.java:144)
at sun.reflect.NativeMethodAccessorImpl.invoke0(Native Method)
at sun.reflect.NativeMethodAccessorImpl.invoke(NativeMethodAccessorImpl.java:62)
at sun.reflect.DelegatingMethodAccessorImpl.invoke(DelegatingMethodAccessorImpl.java:43)
at java.lang.reflect.Method.invoke(Method.java:498)
at org.jboss.arquillian.core.impl.ObserverImpl.invoke(ObserverImpl.java:94)
at org.jboss.arquillian.core.impl.EventContextImpl.invokeObservers(EventContextImpl.java:99)
at org.jboss.arquillian.core.impl.EventContextImpl.proceed(EventContextImpl.java:81)
...
【问题讨论】:
-
您不必显式添加收缩包装作为依赖项吗?
<dependencies> <dependency> <groupId>org.jboss.shrinkwrap.resolver</groupId> <artifactId>shrinkwrap-resolver-depchain</artifactId> <scope>test</scope> <type>pom</type> </dependency> </dependencies> -
我确实尝试添加它(请注意,您的 sn-p 中缺少版本) - 产生相同的结果。
标签: java maven netbeans glassfish jboss-arquillian