【问题标题】:Flutter debug error, FAILURE: Build failed with an exceptionFlutter 调试错误,FAILURE: Build failed with an exception
【发布时间】:2021-12-29 18:34:33
【问题描述】:

为什么会出现以下错误?突然间它开始给出这个错误。

FAILURE:构建失败并出现异常。

  • 在哪里: 脚本 'C:\src\flutter\packages\flutter_tools\gradle\flutter.gradle' 行:1070

  • 出了什么问题: 任务 ':app:compileFlutterBuildDebug' 执行失败。

Process 'command 'C:\src\flutter\bin\flutter.bat'' 以非零退出值 1 结束

  • 尝试: 使用 --stacktrace 选项运行以获取堆栈跟踪。使用 --info 或 --debug 选项运行以获得更多日志输出。运行 --scan 以获得完整的见解。

  • 通过https://help.gradle.org获得更多帮助

BU�LD 在 1m 6s 内失败 异常:Gradle 任务 assembleDebug 失败,退出代码为 1

【问题讨论】:

    标签: flutter


    【解决方案1】:

    您是否尝试删除pubspec.lock 文件?如果没有,请尝试一下。或者试试这些步骤

    Go to pubspec.yaml file in android studio.
    try doing “packages get”
    and then build the project again.
    

    或 关注这个答案https://stackoverflow.com/a/66406390/16094734

    【讨论】:

    • 没用。
    • 嘿,@imonursahin 我用一个 URL 更新了答案,该 URL 将您带到另一个与您的错误类似的答案。试试看。希望它对你有用。
    • 它没有再次发生,奇怪的是我开始在我的所有项目中遇到这个错误
    猜你喜欢
    • 2018-10-27
    • 2021-02-01
    • 2023-01-21
    • 2019-06-11
    • 2021-07-30
    • 1970-01-01
    • 2018-10-05
    • 2018-03-03
    • 1970-01-01
    相关资源
    最近更新 更多