【问题标题】:After upgrade web server (sever 2012 R2) web deploy is now failing升级 Web 服务器(服务器 2012 R2)后,Web 部署现在失败
【发布时间】:2015-09-29 15:36:18
【问题描述】:

我们刚刚将我们的测试网络服务器从 Server 2008 升级到了 Server 2012 R2。我们有一个批处理脚本来部署我们的站点。当它将站点推送到服务器时,它现在失败了。奇怪的是,我可以通过具有相同发布配置文件的 Visual Studio 发布,一切都很好。我们能够升级我们的开发网络服务器,但曾经遇到过这个问题。

当我通过 Visual Studio 2015 发布时会发生以下情况(有效):

>C:\Windows\Microsoft.NET\Framework\v4.0.30319\aspnet_compiler.exe -v \ -p "C:\tfs\TRSApps\Test\Web\Secured Account Access\Member\obj\x86\Release\AspnetCompileMerge\Source" -u "C:\tfs\TRSApps\Test\Web\Secured Account Access\Member\obj\x86\Release\AspnetCompileMerge\TempBuildDir" 
3>Auto ConnectionString Transformed obj\x86\Release\AspnetCompileMerge\TempBuildDir\Web.config into obj\x86\Release\CSAutoParameterize\transformed\Web.config.
3>Copying all files to temporary location below for package/publish:
3>obj\x86\Release\Package\PackageTmp.
3>Start Web Deploy Publish the Application/package to https://web-test3-new:8172/msdeploy.axd?site=TRS ...
3>Adding directory (TRS/subsections/SecureAccountAccess\App_Browsers).
3>Adding directory (TRS/subsections/SecureAccountAccess\bin).
3>Adding directory (TRS/subsections/SecureAccountAccess\Board).
3>Adding directory (TRS/subsections/SecureAccountAccess\Demographics).
3>Adding directory (TRS/subsections/SecureAccountAccess\Estimates).
3>Adding directory (TRS/subsections/SecureAccountAccess\General Information).
3>Adding directory (TRS/subsections/SecureAccountAccess\Includes).
3>Adding directory (TRS/subsections/SecureAccountAccess\Includes\Images).
3>Adding directory (TRS/subsections/SecureAccountAccess\Includes\Scripts).  

这是部署站点的批处理语句:

"C:\Program Files (x86)\MSBuild\14.0\Bin\msbuild.exe" "c:\tfs\trsapps\test\Web\Secured Account Access\Member\TRSSecureAccess.vbproj" /p:VisualStudioVersion=14.0;DeployOnBuild=True;Configuration=Release;Platform=x86;PublishProfile="c:\tfs\trsapps\test\Web\Secured Account Access\Member\My Project\PublishProfiles\Membertest.pubxml";AllowUntrustedCertificate=True;Username=bob;Password=MyPassword /t:Clean;Build /p:OutputPath="c:\tfs\trsapps\test\Web\Secured Account Access\Member\bin"  

fd

PipelineCopyAllFilesToOneFolderForMsdeploy:
  Publish Pipeline Deploy phase Stage PipelineCopyAllFilesToOneFolderForMsdeploy
GenerateMsdeployManifestFiles:
  Generate source manifest file for Web Deploy package/publish ...
MSDeployPublish:
  Start Web Deploy Publish the Application/package to https://web-test3-new:8172/msdeploy.axd?site=TRS ...
  Starting Web deployment task from source: manifest(c:\tfs\trsapps\test\Web\Secured Account Access\Member\bin\_Publish
  edWebsites\TRSSecureAccess_Package\TRSSecureAccess.SourceManifest.xml) to Destination: auto().
C:\Program Files (x86)\MSBuild\Microsoft\VisualStudio\v14.0\Web\Microsoft.Web.Publishing.targets(4276,5): error : Web d
eployment task failed. (Could not complete the request to remote agent URL 'https://web-test3-new:8172/msdeploy.axd?sit
e=TRS'.) [c:\tfs\trsapps\test\Web\Secured Account Access\Member\TRSSecureAccess.vbproj]
C:\Program Files (x86)\MSBuild\Microsoft\VisualStudio\v14.0\Web\Microsoft.Web.Publishing.targets(4276,5): error : This
error indicates that you cannot connect to the server. Make sure the service URL is correct, firewall and network setti
ngs on this computer and on the server computer are configured properly, and the appropriate services have been started
 on the server. [c:\tfs\trsapps\test\Web\Secured Account Access\Member\TRSSecureAccess.vbproj]
C:\Program Files (x86)\MSBuild\Microsoft\VisualStudio\v14.0\Web\Microsoft.Web.Publishing.targets(4276,5): error : Error
 details:\r [c:\tfs\trsapps\test\Web\Secured Account Access\Member\TRSSecureAccess.vbproj]
C:\Program Files (x86)\MSBuild\Microsoft\VisualStudio\v14.0\Web\Microsoft.Web.Publishing.targets(4276,5): error : Could
 not complete the request to remote agent URL 'https://web-test3-new:8172/msdeploy.axd?site=TRS'.\r [c:\tfs\trsapps\tes
t\Web\Secured Account Access\Member\TRSSecureAccess.vbproj]
C:\Program Files (x86)\MSBuild\Microsoft\VisualStudio\v14.0\Web\Microsoft.Web.Publishing.targets(4276,5): error : The u
nderlying connection was closed: An unexpected error occurred on a send.\r [c:\tfs\trsapps\test\Web\Secured Account Acc
ess\Member\TRSSecureAccess.vbproj]
C:\Program Files (x86)\MSBuild\Microsoft\VisualStudio\v14.0\Web\Microsoft.Web.Publishing.targets(4276,5): error : Unabl
e to read data from the transport connection: An existing connection was forcibly closed by the remote host.\r [c:\tfs\
trsapps\test\Web\Secured Account Access\Member\TRSSecureAccess.vbproj]
C:\Program Files (x86)\MSBuild\Microsoft\VisualStudio\v14.0\Web\Microsoft.Web.Publishing.targets(4276,5): error : An ex
isting connection was forcibly closed by the remote host [c:\tfs\trsapps\test\Web\Secured Account Access\Member\TRSSecu
reAccess.vbproj]
  Publish failed to deploy.
Done Building Project "c:\tfs\trsapps\test\Web\Secured Account Access\Member\TRSSecureAccess.vbproj" (Clean;Build targe
t(s)) -- FAILED.


Build FAILED.

"c:\tfs\trsapps\test\Web\Secured Account Access\Member\TRSSecureAccess.vbproj" (Clean;Build target) (1) ->
(MSDeployPublish target) ->
  C:\Program Files (x86)\MSBuild\Microsoft\VisualStudio\v14.0\Web\Microsoft.Web.Publishing.targets(4276,5): error : Web
 deployment task failed. (Could not complete the request to remote agent URL 'https://web-test3-new:8172/msdeploy.axd?s
ite=TRS'.) [c:\tfs\trsapps\test\Web\Secured Account Access\Member\TRSSecureAccess.vbproj]
C:\Program Files (x86)\MSBuild\Microsoft\VisualStudio\v14.0\Web\Microsoft.Web.Publishing.targets(4276,5): error : This
error indicates that you cannot connect to the server. Make sure the service URL is correct, firewall and network setti
ngs on this computer and on the server computer are configured properly, and the appropriate services have been started
 on the server. [c:\tfs\trsapps\test\Web\Secured Account Access\Member\TRSSecureAccess.vbproj]
C:\Program Files (x86)\MSBuild\Microsoft\VisualStudio\v14.0\Web\Microsoft.Web.Publishing.targets(4276,5): error : Error
 details:\r [c:\tfs\trsapps\test\Web\Secured Account Access\Member\TRSSecureAccess.vbproj]
C:\Program Files (x86)\MSBuild\Microsoft\VisualStudio\v14.0\Web\Microsoft.Web.Publishing.targets(4276,5): error : Could
 not complete the request to remote agent URL 'https://web-test3-new:8172/msdeploy.axd?site=TRS'.\r [c:\tfs\trsapps\tes
t\Web\Secured Account Access\Member\TRSSecureAccess.vbproj]
C:\Program Files (x86)\MSBuild\Microsoft\VisualStudio\v14.0\Web\Microsoft.Web.Publishing.targets(4276,5): error : The u
nderlying connection was closed: An unexpected error occurred on a send.\r [c:\tfs\trsapps\test\Web\Secured Account Acc
ess\Member\TRSSecureAccess.vbproj]
C:\Program Files (x86)\MSBuild\Microsoft\VisualStudio\v14.0\Web\Microsoft.Web.Publishing.targets(4276,5): error : Unabl
e to read data from the transport connection: An existing connection was forcibly closed by the remote host.\r [c:\tfs\
trsapps\test\Web\Secured Account Access\Member\TRSSecureAccess.vbproj]
C:\Program Files (x86)\MSBuild\Microsoft\VisualStudio\v14.0\Web\Microsoft.Web.Publishing.targets(4276,5): error : An ex
isting connection was forcibly closed by the remote host [c:\tfs\trsapps\test\Web\Secured Account Access\Member\TRSSecu
reAccess.vbproj]

    0 Warning(s)
    1 Error(s)

【问题讨论】:

    标签: msbuild visual-studio-2015 webdeploy


    【解决方案1】:

    您是否安装了服务器端的先决条件。

    这个link 可能会有所帮助。

    【讨论】:

    • 是的,或者如果不是,那么我当然也很难直接通过 Visual Studio 发布。
    猜你喜欢
    • 1970-01-01
    • 2018-05-17
    • 1970-01-01
    • 1970-01-01
    • 1970-01-01
    • 2012-09-21
    • 2018-04-13
    • 1970-01-01
    • 1970-01-01
    相关资源
    最近更新 更多