【发布时间】:2017-09-08 20:37:10
【问题描述】:
对处理C++项目不太了解,我从GitLab repository下载了Inkscape的源代码,做了一些改动(添加了小功能),并尝试根据INSTALL.md中提供的指令进行编译以及他们网站上提供的其他资源。
虽然我似乎已经在系统上安装了所有依赖项,但在构建文件夹中运行 cmake 后我得到了这个结果:
------------------------------
Building Makefile for Inkscape
------------------------------
Source Dir: /home/user/myProgs/inkscape
Binary Dir: /home/user/myProgs/inkscape/build
-- Creating build files in: /home/user/myProgs/inkscape/build
-- The C compiler identification is GNU 6.3.0
-- The CXX compiler identification is GNU 6.3.0
-- Check for working C compiler: /usr/bin/cc
-- Check for working C compiler: /usr/bin/cc -- works
-- Detecting C compiler ABI info
-- Detecting C compiler ABI info - done
-- Detecting C compile features
-- Detecting C compile features - done
-- Check for working CXX compiler: /usr/bin/c++
-- Check for working CXX compiler: /usr/bin/c++ -- works
-- Detecting CXX compiler ABI info
-- Detecting CXX compiler ABI info - done
-- Detecting CXX compile features
-- Detecting CXX compile features - done
-- Found GTest: /usr/lib/libgtest.so
-- Looking for pthread.h
-- Looking for pthread.h - found
-- Looking for pthread_create
-- Looking for pthread_create - not found
-- Looking for pthread_create in pthreads
-- Looking for pthread_create in pthreads - not found
-- Looking for pthread_create in pthread
-- Looking for pthread_create in pthread - found
-- Found Threads: TRUE
-- Found PkgConfig: /usr/bin/pkg-config (found version "0.29.1")
-- Checking for modules 'harfbuzz;pangocairo;pangoft2;fontconfig;gsl;gmodule-2.0;libsoup-2.4>=2.42'
--
CMake Error at /usr/share/cmake-3.7/Modules/FindPkgConfig.cmake:415 (message):
A required package was not found
Call Stack (most recent call first):
/usr/share/cmake-3.7/Modules/FindPkgConfig.cmake:588 (_pkg_check_modules_internal)
CMakeScripts/DefineDependsandFlags.cmake:42 (pkg_check_modules)
CMakeLists.txt:136 (include)
-- Configuring incomplete, errors occurred!
See also "/home/user/myProgs/inkscape/build/CMakeFiles/CMakeOutput.log".
See also "/home/user/myProgs/inkscape/build/CMakeFiles/CMakeError.log".
DefineDependsandFlags.cmake:42 中的相关行是:
pkg_check_modules(INKSCAPE_DEP REQUIRED
harfbuzz
pangocairo
pangoft2
fontconfig
gsl
gmodule-2.0
libsoup-2.4>=2.42)
据我检查,所有这些软件包都已安装在我的系统上。
这里是CMakeError.log 的内容,这些行可能会提供一些线索:
/usr/bin/cc -DCHECK_FUNCTION_EXISTS=pthread_create CMakeFiles/cmTC_d21be.dir/CheckFunctionExists.c.o -o cmTC_d21be -rdynamic -lpthreads
/usr/bin/ld: cannot find -lpthreads
collect2: error: ld returned 1 exit status
CMakeFiles/cmTC_d21be.dir/build.make:97: recipe for target 'cmTC_d21be' failed
make[1]: *** [cmTC_d21be] Error 1
make[1]: Leaving directory '/home/user/myProgs/inkscape/build/CMakeFiles/CMakeTmp'
Makefile:126: recipe for target 'cmTC_d21be/fast' failed
make: *** [cmTC_d21be/fast] Error 2
我在 Internet 上搜索时找不到任何帮助。
任何帮助,将不胜感激。
我已经尝试在 Kubuntu 17.04 和 Ubuntu 16.04 LTS 上编译
【问题讨论】:
-
是否也安装了这些库的开发包?库包本身不提供针对它们进行编译所需的 C/C++ 头文件。
-
还有:
/usr/bin/ld: cannot find -lpthreads-- 库是pthread,而不是pthreads。这看起来像是 makefile 中的拼写错误。 -
@cdhowie 据我使用 grep 检查,没有地方调用 -lpthreads。 see this
-
pthreads错误无关紧要,它是标准的 CMake 检查。它搜索正确的标志名称,在某些系统上它是-pthreads。 -
运行
pkg-config与所有 inkscape 需要的包,并确保它为每个输出正确的标志。
标签: c++ compilation cmake inkscape