【问题标题】:Android Studio cannot find symbol errorAndroid Studio 找不到符号错误
【发布时间】:2014-11-27 11:06:33
【问题描述】:

如果这是一个菜鸟问题,我很抱歉,但我最近从 Eclipse 迁移到 Android Studio,之前从未使用过 Gradle。我从 Eclipse 导入了一个项目,它依赖于 3 个库(UIL、androidBootStrap、androidLockpattern)。这些库可以在我的 android studio 项目的根目录下看到,但是当我单击构建时,我不断收到以下错误

G:\AndroidstudioProjects\P3 Authentication\p3Authentication\src\main\java\com\p3authentication\Captcha_Verfication.java
Error:(11, 45) error: cannot find symbol class Settings
Error:(25, 18) error: cannot find symbol variable MATRIX_WIDTH
Error:(27, 11) error: package Settings does not exist
Error:(28, 49) error: cannot find symbol variable ACTION_VERIFY_CAPTCHA
Error:(47, 28) error: cannot find symbol variable RESULT_FAILED
Error:(58, 25) error: cannot find symbol variable EXTRA_RETRY_COUNT
G:\AndroidstudioProjects\P3 Authentication\p3Authentication\src\main\java\com\p3authentication\Compare_Pattern.java
Error:(35, 18) error: cannot find symbol variable MATRIX_WIDTH
Error:(37, 49) error: cannot find symbol variable ACTION_COMPARE_PATTERN
Error:(39, 38) error: cannot find symbol variable EXTRA_PATTERN
Error:(70, 28) error: cannot find symbol variable RESULT_FAILED
Error:(75, 28) error: cannot find symbol variable RESULT_FORGOT_PATTERN
Error:(86, 25) error: cannot find symbol variable EXTRA_RETRY_COUNT
G:\AndroidstudioProjects\P3 Authentication\p3Authentication\src\main\java\com\p3authentication\Create_Pattern.java
Error:(26, 18) error: cannot find symbol variable MATRIX_WIDTH
Error:(28, 49) error: cannot find symbol variable ACTION_CREATE_PATTERN
Error:(41, 45) error: cannot find symbol variable EXTRA_PATTERN
G:\AndroidstudioProjects\P3 Authentication\p3Authentication\src\main\java\com\p3authentication\Pattern_Captcha.java
Error:(12, 45) error: cannot find symbol class Settings
Error:(23, 11) error: package Settings does not exist
Error:(24, 49) error: cannot find symbol variable ACTION_VERIFY_CAPTCHA
Error:(57, 28) error: cannot find symbol variable RESULT_FAILED
Error:(68, 25) error: cannot find symbol variable EXTRA_RETRY_COUNT
Note: G:\AndroidstudioProjects\P3 Authentication\p3Authentication\src\main\java\com\p3authentication\LockerService.java uses or overrides a deprecated API.
Note: Recompile with -Xlint:deprecation for details.
Error:Execution failed for task ':p3Authentication:compileDebugJava'.
> Compilation failed; see the compiler error output for details.

我知道所有这些类和变量都存在,因为当我从 Eclipse 运行我的应用程序时,它运行完美,没有任何问题。任何如何克服这个问题的想法都被感激地接受了

【问题讨论】:

  • 发布您的 build.gradle 文件和项目文件夹结构的屏幕截图

标签: android eclipse gradle android-studio


【解决方案1】:

这个问题的一个来源是,如果您使用库模块,则需要使用插件“android-library”才能将它们打包并提供给您的应用程序。 如果您正在使用 gradle 构建库并使用 compile project(":UIL") 依赖它们,这可能是您的问题。

带库的多项目设置:

在每个库的构建文件中,您可能应该有以下行:

apply plugin: "android-library"

我认为它可能会要求您将其从 android-library 更正为 com.android.library

【讨论】:

    猜你喜欢
    • 1970-01-01
    • 2019-11-16
    • 1970-01-01
    • 1970-01-01
    • 1970-01-01
    • 2016-04-06
    • 1970-01-01
    • 2016-03-02
    • 1970-01-01
    相关资源
    最近更新 更多