【问题标题】:Error:Execution failed for task ':app:packageDebug'. > com.android.builder.packaging.PackagerException错误:任务“:app:packageDebug”执行失败。 > com.android.builder.packaging.PackagerException
【发布时间】:2016-05-21 13:28:32
【问题描述】:

我用的是Android Studio 2.0 RC 1,今天android studio给自己报错了。

错误:任务 ':app:packageDebug' 执行失败。 com.android.builder.packaging.PackagerException:java.io.IOException: 无法读取 zip 文件 'D:\Unimag\MyUnimax21042016\app\ 构建\输出\apk\app-debug.apk'。

我的 gradle 文件:

apply plugin: 'com.android.application'


android {
    compileSdkVersion 23
    buildToolsVersion "23.0.1"

    defaultConfig {
        applicationId "kz.dreamwings.unimax"
        minSdkVersion 15
        targetSdkVersion 23
        versionCode 2
        versionName "0.0.2"
    }
    buildTypes {
        release {
            minifyEnabled false
            proguardFiles getDefaultProguardFile('proguard-android.txt'), 'proguard-rules.pro'
        }

        debug {
            debuggable true
        }
    }
}



dependencies {
    compile fileTree(dir: 'libs', include: ['*.jar'])
    compile 'com.android.support:appcompat-v7:23.0.1'
    compile 'com.android.support:design:23.0.1'
    compile 'com.mcxiaoke.volley:library:1.0.19'
    compile 'com.android.support:cardview-v7:23.1.1'
    compile 'com.android.support:recyclerview-v7:23.2.1'
    compile 'com.joanzapata.iconify:android-iconify-fontawesome:2.2.2'
    compile 'com.squareup.picasso:picasso:2.5.2'
    compile 'com.github.rahatarmanahmed:circularprogressview:2.5.0'

}

以及来自 Messages Gradle Build 的完整消息

Information:Gradle tasks [:app:assembleDebug]
:app:preBuild UP-TO-DATE
:app:preDebugBuild UP-TO-DATE
:app:checkDebugManifest
:app:preReleaseBuild UP-TO-DATE
:app:prepareComAndroidSupportAppcompatV72301Library UP-TO-DATE
:app:prepareComAndroidSupportCardviewV72311Library UP-TO-DATE
:app:prepareComAndroidSupportDesign2301Library UP-TO-DATE
:app:prepareComAndroidSupportRecyclerviewV72321Library UP-TO-DATE
:app:prepareComAndroidSupportSupportV42321Library UP-TO-DATE
:app:prepareComGithubRahatarmanahmedCircularprogressview250Library UP-TO-DATE
:app:prepareComJoanzapataIconifyAndroidIconify222Library UP-TO-DATE
:app:prepareComJoanzapataIconifyAndroidIconifyFontawesome222Library UP-TO-DATE
:app:prepareDebugDependencies
:app:compileDebugAidl UP-TO-DATE
:app:compileDebugRenderscript UP-TO-DATE
:app:generateDebugBuildConfig UP-TO-DATE
:app:mergeDebugShaders UP-TO-DATE
:app:compileDebugShaders UP-TO-DATE
:app:generateDebugAssets UP-TO-DATE
:app:mergeDebugAssets UP-TO-DATE
:app:generateDebugResValues UP-TO-DATE
:app:generateDebugResources UP-TO-DATE
:app:mergeDebugResources UP-TO-DATE
:app:processDebugManifest UP-TO-DATE
:app:processDebugResources UP-TO-DATE
:app:generateDebugSources UP-TO-DATE
:app:incrementalDebugJavaCompilationSafeguard UP-TO-DATE
:app:compileDebugJavaWithJavac UP-TO-DATE
:app:compileDebugNdk UP-TO-DATE
:app:compileDebugSources UP-TO-DATE
:app:prePackageMarkerForDebug
:app:transformClassesWithDexForDebug UP-TO-DATE
:app:mergeDebugJniLibFolders UP-TO-DATE
:app:transformNative_libsWithMergeJniLibsForDebug UP-TO-DATE
:app:processDebugJavaRes UP-TO-DATE
:app:transformResourcesWithMergeJavaResForDebug UP-TO-DATE
:app:validateDebugSigning
:app:packageDebug FAILED
Error:Execution failed for task ':app:packageDebug'.
> com.android.builder.packaging.PackagerException: java.io.IOException: Failed to read zip file 'D:\Unimag\MyUnimax21042016\app\build\outputs\apk\app-debug.apk'.
Information:BUILD FAILED
Information:Total time: 0.648 secs
Information:1 error
Information:0 warnings
Information:See complete output in console

【问题讨论】:

  • 这个问题解决了吗?
  • @GowthamChandrasekaran 检查我的答案

标签: android android-studio-2.0


【解决方案1】:

我能够使用 Android Studio 的一个活动模板在一个干净的项目上重现该问题。对我来说,问题是 gradle 插件的预览版。您使用的是 Android Studio 2.2 Preview 1 吗?如果是,那么在你的 build.gradle 中找到这一行:

classpath 'com.android.tools.build:gradle:+

并将其更改为:

classpath 'com.android.tools.build:gradle:2.1.0'

对我来说,这解决了问题。

【讨论】:

    【解决方案2】:

    这发生在我切换 GIT 分支时。它可以运行Build -> Clean Project。

    MacOS 10.12 Sierra

    【讨论】:

      【解决方案3】:

      我尝试手动删除文件,但 SO 通知:文件“app-debug.apk”正在由“OpenJDK 平台二进制”使用。然后我杀了“OpenJDK Platform Binary”,这行得通。

      【讨论】:

        【解决方案4】:

        删除平台并重新安装,就这个。

        【讨论】:

          猜你喜欢
          • 1970-01-01
          • 2015-05-13
          • 1970-01-01
          • 2016-06-03
          • 1970-01-01
          • 2016-07-29
          • 1970-01-01
          • 2019-12-05
          • 2016-12-11
          相关资源
          最近更新 更多