【发布时间】:2014-05-14 14:04:18
【问题描述】:
我在 VisualStudio2012 中编译“Hello world”CUDA 程序时遇到了一点问题。我已经从 Nvidia 下载了示例:
#include "stdafx.h"
#include "cuda.h"
#include "cuda_runtime.h"
#include "device_launch_parameters.h"
#include <stdio.h>
__device__ const char *STR = "HELLO WORLD!";
const char STR_LENGTH = 12;
__global__ void hello()
{
printf("%c\n", STR[threadIdx.x % STR_LENGTH]);
}
int main(void)
{
int num_threads = STR_LENGTH;
int num_blocks = 1;
hello<<<num_blocks,num_threads>>>();
cudaDeviceSynchronize();
return 0;
}
我将构建配置更改为 cuda 6.0,在项目属性中添加了包含和库路径。尽管如此,它还是在这一行给了我一个错误:
hello<<<num_blocks,num_threads>>>();
它对
编辑:
我在属性>常规中将文件的项目类型更改为“CUDA C/C++”。现在它可以编译了,但是有错误:
1>------ Build started: Project: CUDATest, Configuration: Debug Win32 ------
1> Compiling CUDA source file CUDATest.cu...
1>
1> C:\Users\Rafał\Documents\Visual Studio 2012\Projects\CUDATest\CUDATest>"C:\Program Files\NVIDIA GPU Computing Toolkit\CUDA\v6.0\bin\nvcc.exe" -gencode=arch=compute_10,code=\"sm_10,compute_10\" --use-local-env --cl-version 2012 -ccbin "C:\Program Files\Microsoft Visual Studio 11.0\VC\bin" -I"C:\Program Files\NVIDIA GPU Computing Toolkit\CUDA\v6.0\include" -I"C:\Program Files\NVIDIA GPU Computing Toolkit\CUDA\v6.0\include" -G --keep-dir Debug -maxrregcount=0 --machine 32 --compile -cudart static -g -DWIN32 -D_DEBUG -D_CONSOLE -D_UNICODE -DUNICODE -Xcompiler "/EHsc /W3 /nologo /Od /Zi /RTC1 /MDd " -o Debug\CUDATest.cu.obj "C:\Users\Rafał\Documents\Visual Studio 2012\Projects\CUDATest\CUDATest\CUDATest.cu"
1>nvcc : warning : The 'compute_10' and 'sm_10' architectures are deprecated, and may be removed in a future release.
1>C:/Users/Rafa│/Documents/Visual Studio 2012/Projects/CUDATest/CUDATest/CUDATest.cu(15): error : calling a __host__ function("printf") from a __global__ function("hello") is not allowed
1> CUDATest.cu
1>C:\Program Files\MSBuild\Microsoft.Cpp\v4.0\V110\BuildCustomizations\CUDA 6.0.targets(597,9): error MSB3721: The command ""C:\Program Files\NVIDIA GPU Computing Toolkit\CUDA\v6.0\bin\nvcc.exe" -gencode=arch=compute_10,code=\"sm_10,compute_10\" --use-local-env --cl-version 2012 -ccbin "C:\Program Files\Microsoft Visual Studio 11.0\VC\bin" -I"C:\Program Files\NVIDIA GPU Computing Toolkit\CUDA\v6.0\include" -I"C:\Program Files\NVIDIA GPU Computing Toolkit\CUDA\v6.0\include" -G --keep-dir Debug -maxrregcount=0 --machine 32 --compile -cudart static -g -DWIN32 -D_DEBUG -D_CONSOLE -D_UNICODE -DUNICODE -Xcompiler "/EHsc /W3 /nologo /Od /Zi /RTC1 /MDd " -o Debug\CUDATest.cu.obj "C:\Users\Rafał\Documents\Visual Studio 2012\Projects\CUDATest\CUDATest\CUDATest.cu"" exited with code 2.
========== Build: 0 succeeded, 1 failed, 0 up-to-date, 0 skipped ==========
如果我评论 printf 函数,那么我会得到这样的结果:
1>------ Build started: Project: CUDATest, Configuration: Debug Win32 ------
1> Compiling CUDA source file CUDATest.cu...
1>
1> C:\Users\Rafał\Documents\Visual Studio 2012\Projects\CUDATest\CUDATest>"C:\Program Files\NVIDIA GPU Computing Toolkit\CUDA\v6.0\bin\nvcc.exe" -gencode=arch=compute_10,code=\"sm_10,compute_10\" --use-local-env --cl-version 2012 -ccbin "C:\Program Files\Microsoft Visual Studio 11.0\VC\bin" -I"C:\Program Files\NVIDIA GPU Computing Toolkit\CUDA\v6.0\include" -I"C:\Program Files\NVIDIA GPU Computing Toolkit\CUDA\v6.0\include" -G --keep-dir Debug -maxrregcount=0 --machine 32 --compile -cudart static -g -DWIN32 -D_DEBUG -D_CONSOLE -D_UNICODE -DUNICODE -Xcompiler "/EHsc /W3 /nologo /Od /Zi /RTC1 /MDd " -o Debug\CUDATest.cu.obj "C:\Users\Rafał\Documents\Visual Studio 2012\Projects\CUDATest\CUDATest\CUDATest.cu"
1>nvcc : warning : The 'compute_10' and 'sm_10' architectures are deprecated, and may be removed in a future release.
1>ptxas : fatal error : Ptx assembly aborted due to errors
1> CUDATest.cu
1>C:\Program Files\MSBuild\Microsoft.Cpp\v4.0\V110\BuildCustomizations\CUDA 6.0.targets(597,9): error MSB3721: The command ""C:\Program Files\NVIDIA GPU Computing Toolkit\CUDA\v6.0\bin\nvcc.exe" -gencode=arch=compute_10,code=\"sm_10,compute_10\" --use-local-env --cl-version 2012 -ccbin "C:\Program Files\Microsoft Visual Studio 11.0\VC\bin" -I"C:\Program Files\NVIDIA GPU Computing Toolkit\CUDA\v6.0\include" -I"C:\Program Files\NVIDIA GPU Computing Toolkit\CUDA\v6.0\include" -G --keep-dir Debug -maxrregcount=0 --machine 32 --compile -cudart static -g -DWIN32 -D_DEBUG -D_CONSOLE -D_UNICODE -DUNICODE -Xcompiler "/EHsc /W3 /nologo /Od /Zi /RTC1 /MDd " -o Debug\CUDATest.cu.obj "C:\Users\Rafał\Documents\Visual Studio 2012\Projects\CUDATest\CUDATest\CUDATest.cu"" exited with code -1.
========== Build: 0 succeeded, 1 failed, 0 up-to-date, 0 skipped ==========
【问题讨论】:
-
这只是编辑器中的红色下划线,还是实际的编译错误?请在编译项目时提供 Visual Studio 的实际错误输出。
-
你是如何命名文件的? MSVC 可能对
.cpp与.cu比较挑剔。另外,您能解释一下“我将构建配置更改为 cuda 6.0”的确切含义吗? -
是编辑器中的下划线。错误是“错误 1 错误 C2059:语法错误:'
-
您应该将您的测试文件从
CUDATest.cpp重命名为CUDATest.cu以使nvcc拦截它。 -
我在几分钟前试过了,遗憾的是它并没有改变任何东西。