【发布时间】:2014-09-01 09:53:41
【问题描述】:
以下是我目前的环境
- Boost 版本 - 1.55
- Cmake - 2.8
- Ubuntu - 12.04
- g++ - 4.8
- MPI - 1.8.1
- BLAS/LAPACK - 英特尔 MKL
当我在上述设置中编译我的 Boost MPI 代码时,我收到以下错误。
`.text._ZN5boost16exception_detail19error_info_injectorINS_3mpi9exceptionEED2Ev' referenced in section `.text._ZN5boost16exception_detail19error_info_injectorINS_3mpi9exceptionEED1Ev[_ZN5boost16exception_detail19error_info_injectorINS_3mpi9exceptionEED1Ev]' of /usr/lib/x86_64-linux-gnu/libboost_mpi.a(broadcast.o): defined in discarded section `.text._ZN5boost16exception_detail19error_info_injectorINS_3mpi9exceptionEED2Ev[_ZN5boost16exception_detail19error_info_injectorINS_3mpi9exceptionEED5Ev]' of /usr/lib/x86_64-linux-gnu/libboost_mpi.a(broadcast.o)
`.text._ZN5boost16exception_detail19error_info_injectorINS_17bad_function_callEED2Ev' referenced in section `.text._ZN5boost16exception_detail19error_info_injectorINS_17bad_function_callEED1Ev[_ZN5boost16exception_detail19error_info_injectorINS_17bad_function_callEED1Ev]' of /usr/lib/x86_64-linux-gnu/libboost_program_options.a(cmdline.o): defined in discarded section `.text._ZN5boost16exception_detail19error_info_injectorINS_17bad_function_callEED2Ev[_ZN5boost16exception_detail19error_info_injectorINS_17bad_function_callEED5Ev]' of /usr/lib/x86_64-linux-gnu/libboost_program_options.a(cmdline.o)
`.text._ZN5boost16exception_detail19error_info_injectorINS_15program_options16validation_errorEED2Ev' referenced in section `.text._ZN5boost16exception_detail19error_info_injectorINS_15program_options16validation_errorEED1Ev[_ZN5boost16exception_detail19error_info_injectorINS_15program_options16validation_errorEED1Ev]' of /usr/lib/x86_64-linux-gnu/libboost_program_options.a(value_semantic.o): defined in discarded section `.text._ZN5boost16exception_detail19error_info_injectorINS_15program_options16validation_errorEED2Ev[_ZN5boost16exception_detail19error_info_injectorINS_15program_options16validation_errorEED5Ev]' of /usr/lib/x86_64-linux-gnu/libboost_program_options.a(value_semantic.o)
`.text._ZN5boost16exception_detail19error_info_injectorISt11logic_errorED2Ev' referenced in section `.text._ZN5boost16exception_detail19error_info_injectorISt11logic_errorED1Ev[_ZN5boost16exception_detail19error_info_injectorISt11logic_errorED1Ev]' of /usr/lib/x86_64-linux-gnu/libboost_program_options.a(convert.o): defined in discarded section `.text._ZN5boost16exception_detail19error_info_injectorISt11logic_errorED2Ev[_ZN5boost16exception_detail19error_info_injectorISt11logic_errorED5Ev]' of /usr/lib/x86_64-linux-gnu/libboost_program_options.a(convert.o)
`.text._ZN5boost16exception_detail19error_info_injectorINS_9iostreams10gzip_errorEED2Ev' referenced in section `.text._ZN5boost16exception_detail19error_info_injectorINS_9iostreams10gzip_errorEED1Ev[_ZN5boost16exception_detail19error_info_injectorINS_9iostreams10gzip_errorEED1Ev]' of /usr/lib/x86_64-linux-gnu/libboost_iostreams.a(gzip.o): defined in discarded section `.text._ZN5boost16exception_detail19error_info_injectorINS_9iostreams10gzip_errorEED2Ev[_ZN5boost16exception_detail19error_info_injectorINS_9iostreams10gzip_errorEED5Ev]' of /usr/lib/x86_64-linux-gnu/libboost_iostreams.a(gzip.o)
collect2: error: ld returned 1 exit status
make[2]: *** [factor] Error 1
make[1]: *** [CMakeFiles/factor.dir/all] Error 2
make: *** [all] Error 2
浏览互联网,我想出了以下解决方案,但它们都不起作用。
- 拥有最新的所有软件编译器、库、cmake 等。我拥有最新的。但我仍然有问题。
- 包括 -fexceptions 和 -fno-use-linker-plugin。我的当前链接器命令仍然出现错误,如下所示。
/usr/bin/mpicxx -fexceptions -fno-use-linker-plugin CMakeFiles/factor.dir/factor.cpp.o CMakeFiles/factor.dir/factor_jobs.cpp.o -o factor -rdynamic -L/home/ramki/libraries/armadillo-4.300.0/usr/lib -L/home/ramki/intel/mkl/lib/intel64 /usr/lib/x86_64-linux-gnu/libboost_mpi.a /usr/lib/x86_64-linux-gnu/libboost_program_options.a /usr/lib/x86_64-linux-gnu/libboost_iostreams.a -lboost_serialization -lboost_iostreams -lboost_program_options -lboost_mpi -llapack -lmkl_intel_lp64 -lmkl_core -lmkl_sequential -lpthread -lm -lz -larmadillo factorization/libfactorization.a -Wl,-rpath,/home/ramki/libraries/armadillo-4.300.0/usr/lib:/home/ramki/intel/mkl/lib/intel64 - 更改链接库的顺序 - 即使这样也无济于事。
让我知道错误是什么以及如何解决此错误。
【问题讨论】: