【发布时间】:2021-05-24 16:26:36
【问题描述】:
我正在尝试构建我的 quarkus 项目,但它给我的期望低于预期,因为我是新手,所以我不知道到底是什么问题。请帮帮我,我尝试了很多方法,例如排除,但没有任何效果。
2021-02-22 17:36:59,100 ERROR [io.qua.dep.dev.IsolatedDevModeMain] (main) Failed to start quarkus: java.lang.RuntimeException: io.quarkus.builder.BuildException: Build failure: Build failed due to errors
[error]: Build step io.quarkus.arc.deployment.ArcProcessor#registerBeans threw an exception: java.lang.SecurityException: Invalid signature file digest for Manifest main attributes
at java.base/sun.security.util.SignatureFileVerifier.processImpl(SignatureFileVerifier.java:336)
at java.base/sun.security.util.SignatureFileVerifier.process(SignatureFileVerifier.java:269)
at java.base/java.util.jar.JarVerifier.processEntry(JarVerifier.java:273)
at java.base/java.util.jar.JarVerifier.update(JarVerifier.java:230)
at java.base/java.util.jar.JarFile.initializeVerifier(JarFile.java:759)
at java.base/java.util.jar.JarFile.getInputStream(JarFile.java:840)
at io.quarkus.bootstrap.classloading.JarClassPathElement$1$1$1.apply(JarClassPathElement.java:123)
at io.quarkus.bootstrap.classloading.JarClassPathElement$1$1$1.apply(JarClassPathElement.java:118)
at io.quarkus.bootstrap.classloading.JarClassPathElement.withJarFile(JarClassPathElement.java:161)
at io.quarkus.bootstrap.classloading.JarClassPathElement.access$100(JarClassPathElement.java:35)
at io.quarkus.bootstrap.classloading.JarClassPathElement$1$1.getData(JarClassPathElement.java:118)
at io.quarkus.bootstrap.classloading.QuarkusClassLoader.getResourceAsStream(QuarkusClassLoader.java:332)
at io.quarkus.bootstrap.classloading.QuarkusClassLoader.getResourceAsStream(QuarkusClassLoader.java:353)
at io.quarkus.arc.processor.BeanArchives.index(BeanArchives.java:259)
【问题讨论】: