【发布时间】:2014-05-23 01:07:01
【问题描述】:
我使用自制软件安装了 opencv。没有jar文件。好像找不到jar文件。再次尝试下载 - opencv 2.4.3、2.4.7、2.4.8。再次尝试构建,但在构建 jar 文件的过程中出现错误。 我正在尝试在 Netbeans 中创建一个 OpenCV Java 项目。我试图寻找 jar 文件。由于它不存在,我构建了 Opencv 但出现错误。
尝试这个来构建 OpenCv jar:
$ cd opencv-2.4.7
$ mkdir build
$ cd build/
$ cmake -G "Unix Makefiles" -D CMAKE_CXX_COMPILER=/usr/bin/g++ -D CMAKE_C_COMPILER=/usr/bin/gcc -D WITH_CUDA=ON ..
$make -j4
$ make install
我使用的是 MacOSX 10.8.5。 任何帮助将不胜感激。
我得到的错误是:
BUILD FAILED
/Users/ih/Downloads/opencv-2.4.7/build/build.xml:9: Class not
found: javac1.8
Total time: 0 seconds make[2]: *** [bin/opencv-247.jar] Error 1
make[1]: *** [modules/java/CMakeFiles/opencv_java.dir/all] Error 2
make[1]: *** Waiting for unfinished jobs.... Linking CXX shared
library ../../lib/cv2.so [ 89%] Built target opencv_python make: ***
[all] Error 2
只是为了确认我确实安装了 javac。
【问题讨论】:
-
... 错误是?
-
我添加了一个链接。在这里,我粘贴了构建它时遇到的错误。 @berak
-
哦,不放在这里,把它附加到你的q。
标签: java c++ opencv netbeans homebrew