【发布时间】:2016-11-30 00:26:04
【问题描述】:
我正在尝试从“使用 NIFI、KAFKA 和 STORM 在 HADOOP 中进行实时事件处理”Hortonworks 教程中构建“流模拟器”,尤其是从其“实验室 0:使用 APACHE NIFI 摄取、路由和登陆实时事件”中。
为了让您大致了解这是什么,这里是 Hortoworks 页面的描述:“流模拟器是一个生成卡车事件数据的轻量级框架。模拟器使用定义驾驶员道路路径的纽约市卡车路线 (kml)带有纬度和经度信息。 该模拟器使用 Akka 来简化并发、消息传递和继承。它有两个普通的旧 Java 对象 (POJOS),一个用于卡车,另一个用于生成事件的驱动程序。”
当我尝试在构建结束时按照最新 Hortonworks Sandbox (HDP 2.4) 的指示构建模拟器时,Maven 报告此错误:
[ERROR] Failed to execute goal on project storm-kafka-0.8-plus:
Could not resolve dependencies for project net.wurstmeister.storm:
storm-kafka-0.8-plus:jar:0.4: Failed to collect dependencies at org.apache.storm:storm-core:jar:
0.9.1-incubating -> clj-time:clj-time:jar:0.4.1:
Failed to read artifact descriptor for clj-time:clj-time:jar:0.4.1:
Could not transfer artifact clj-time:clj-time:pom:0.4.1 from/to clojars (https://clojars.org/repo/):
sun.security.validator.ValidatorException: PKIX path building failed:
sun.security.provider.certpath.SunCertPathBuilderException:
unable to find valid certification path to requested target
更详细的(maven -e)揭示了这些错误细节:
...
Caused by: sun.security.validator.ValidatorException: PKIX path building failed: sun.security.provider.certpath.SunCertPathBuilderException: unable to find valid certification path to requested target
at sun.security.validator.PKIXValidator.doBuild(PKIXValidator.java:385)
at sun.security.validator.PKIXValidator.engineValidate(PKIXValidator.java:292)
at sun.security.validator.Validator.validate(Validator.java:260)
at sun.security.ssl.X509TrustManagerImpl.validate(X509TrustManagerImpl.java:326)
at sun.security.ssl.X509TrustManagerImpl.checkTrusted(X509TrustManagerImpl.java:231)
at sun.security.ssl.X509TrustManagerImpl.checkServerTrusted(X509TrustManagerImpl.java:126)
at sun.security.ssl.ClientHandshaker.serverCertificate(ClientHandshaker.java:1454)
... 74 more
Caused by: sun.security.provider.certpath.SunCertPathBuilderException: unable to find valid certification path to requested target
at sun.security.provider.certpath.SunCertPathBuilder.engineBuild(SunCertPathBuilder.java:196)
at java.security.cert.CertPathBuilder.build(CertPathBuilder.java:268)
at sun.security.validator.PKIXValidator.doBuild(PKIXValidator.java:380)
... 80 more
这里是 pom.xml 导致构建错误:
<project xmlns="http://maven.apache.org/POM/4.0.0"
xmlns:xsi="http://www.w3.org/2001/XMLSchema-instance"
xsi:schemaLocation="http://maven.apache.org/POM/4.0.0
http://maven.apache.org/maven-v4_0_0.xsd">
<modelVersion>4.0.0</modelVersion>
<groupId>com.hortonworks</groupId>
<artifactId>storm-demo</artifactId>
<packaging>pom</packaging>
<version>1.0</version>
<name>Storm Demo Parent Project</name>
<modules>
<module>transport-domain</module>
<module>stream-simulator</module>
<module>storm-streaming</module>
<module>storm-demo-webapp</module>
<module>storm-kafkaplus</module>
<!-- <module>iot-integration-tester</module> -->
</modules>
<build>
<pluginManagement>
<plugins>
<plugin>
<groupId>org.apache.maven.plugins</groupId>
<artifactId>maven-compiler-plugin</artifactId>
<configuration>
<source>1.7</source>
<target>1.7</target>
</configuration>
</plugin>
</plugins>
</pluginManagement>
</build>
<dependencies>
<dependency>
<groupId>junit</groupId>
<artifactId>junit</artifactId>
<version>3.8.1</version>
<scope>test</scope>
</dependency>
</dependencies>
任何想法如何解决这个问题?请帮忙!
更新:下一次构建错误
修复证书问题后,我现在有下一个错误:
[INFO] ------------------------------------------------------------------------
[INFO] Building Storm Demo Parent Project 1.0
[INFO] ------------------------------------------------------------------------
Downloading: https://repo.maven.apache.org/maven2/org/apache/maven/plugins/maven-compiler-plugin/maven-metadata.xml
[WARNING] Could not transfer metadata org.apache.maven.plugins:maven-compiler-plugin/maven-metadata.xml from/to central (https://repo.maven.apache.org/maven2): sun.security.validator.ValidatorException: PKIX path building failed: sun.security.provider.certpath.SunCertPathBuilderException: unable to find valid certification path to requested target
[INFO] ------------------------------------------------------------------------
[INFO] Reactor Summary:
[INFO]
[INFO] transport-domain ................................... SUCCESS [ 2.233 s]
[INFO] stream-simulator ................................... SUCCESS [ 3.694 s]
[INFO] storm-streaming .................................... SUCCESS [01:13 min]
[INFO] storm-demo-webapp .................................. SUCCESS [ 8.642 s]
[INFO] storm-kafka-0.8-plus ............................... SUCCESS [ 17.440 s]
[INFO] Storm Demo Parent Project .......................... FAILURE [ 0.171 s]
[INFO] ------------------------------------------------------------------------
[INFO] BUILD FAILURE
[INFO] ------------------------------------------------------------------------
[INFO] Total time: 01:45 min
[INFO] Finished at: 2016-07-26T14:15:46+00:00
[INFO] Final Memory: 119M/826M
[INFO] ------------------------------------------------------------------------
[ERROR] Error resolving version for plugin 'org.apache.maven.plugins:maven-compiler-plugin' from the repositories [local (/root/.m2/repository), central (https://repo.maven.apache.org/maven2)]: Plugin not found in any plugin repository
【问题讨论】:
标签: maven certificate apache-kafka apache-storm hortonworks-data-platform