【发布时间】:2011-07-18 01:06:48
【问题描述】:
我正在尝试在我的 Macbook Pro 上编译 MacVim,但是当它运行 make 时,我遇到了一些错误:
=== BUILD NATIVE TARGET MacVim OF PROJECT MacVim WITH THE DEFAULT CONFIGURATION (Release) ===
Check dependencies
PBXCp build/Release/MacVim.app/Contents/MacOS/Vim ../Vim
cd /Users/Nathan/Downloads/b4winckler-macvim-6e6fac5/src/MacVim
/Developer/Library/PrivateFrameworks/DevToolsCore.framework/Resources/pbxcp -exclude .DS_Store -exclude CVS -exclude .svn -exclude .git -strip-debug-symbols -resolve-src-symlinks /Users/Nathan/Downloads/b4winckler-macvim-6e6fac5/src/MacVim/../Vim /Users/Nathan/Downloads/b4winckler-macvim-6e6fac5/src/MacVim/build/Release/MacVim.app/Contents/MacOS
PhaseScriptExecution "Make Document Icons" build/MacVim.build/Release/MacVim.build/Script-1D1C31F00EFFBFD6003FE9A5.sh
cd /Users/Nathan/Downloads/b4winckler-macvim-6e6fac5/src/MacVim
/bin/sh -c /Users/Nathan/Downloads/b4winckler-macvim-6e6fac5/src/MacVim/build/MacVim.build/Release/MacVim.build/Script-1D1C31F00EFFBFD6003FE9A5.sh
unzip -jo EnvyCodeR.zip
Archive: EnvyCodeR.zip
Command /bin/sh failed with exit code 2
Command /bin/sh failed with exit code 2
Touch build/Release/MacVim.app
cd /Users/Nathan/Downloads/b4winckler-macvim-6e6fac5/src/MacVim
/usr/bin/touch -c /Users/Nathan/Downloads/b4winckler-macvim-6e6fac5/src/MacVim/build/Release/MacVim.app
** BUILD FAILED **
The following build commands failed:
MacVim:
PhaseScriptExecution "Make Document Icons" /Users/Nathan/Downloads/b4winckler-macvim-6e6fac5/src/MacVim/build/MacVim.build/Release/MacVim.build/Script-1D1C31F00EFFBFD6003FE9A5.sh
(1 failure)
make[1]: *** [macvim] Error 1
make: *** [first] Error 2
我需要做什么来纠正这个问题?
【问题讨论】:
-
您有
unzip命令吗?您的文件系统是否已满? -
是的,我已经安装了
unzip
标签: vim makefile compilation macvim