【发布时间】:2014-04-21 04:38:43
【问题描述】:
我正在尝试使用 ubuntu 来“制作”一个项目。 我收到此错误:
sh: 1: hg: not found
make[3]: *** [/home/user/myproject/build/CMakeFiles/stamp/eigen3-download] Error 127
make[2]: *** [CMakeFiles/eigen3.dir/all] Error 2
make[1]: *** [all] Error 2
make: *** [externals] Error 2
有什么问题?
谢谢
【问题讨论】:
-
项目通常有一个安装或自述文件或主页,您可以在其中查看构建它必须安装的依赖项。